Home > Error Code > With Error Code 3010 Msiexec

With Error Code 3010 Msiexec

Contents

fyi. ERROR_INSTALL_SERVICE_FAILURE1601The Windows Installer service could not be accessed. Exit Safe Mode and try again or try using System Restore to return your computer to a previous state. Verify that the source exists and that you can access it. 1613 ERROR_INSTALL_PACKAGE_VERSION This installation package cannot be installed by the Windows Installer service. http://isusaa.org/error-code/with-error-code-3010.php

Invalid info: [... 2742: Marshaling to Server failed: [2]. 2743: "Could not execute custom action [2], location: [3], command: [4]." 2744: "EXE failed called by custom action [2], location: [3], command: Note that installations that end in .exe can still be a Windows Installer setup if the exe is merely a wrapper around a Windows Installer package (msi or msp etc). Transform: Cannot transform a temporary table. ERROR_INSTALL_FAILURE1603A fatal error occurred during installation. https://msdn.microsoft.com/en-us/library/windows/desktop/aa376931(v=vs.85).aspx

Msi Error Codes

It means something is wrong with the package. 1604 ERROR_INSTALL_SUSPEND Installation suspended, incomplete. 1605 ERROR_UNKNOWN_PRODUCT This action is only valid for products that are currently installed. ERROR_APPHELP_BLOCK1259If Windows Installer determines a product may be incompatible with the current operating system, it displays a dialog box informing the user and asking whether to try to install anyway. Primary key: '[3]'. 2613: RemoveExistingProducts action sequenced incorrectly. 2614: Could not access IStorage object from installation package. 2615: Skipped unregistration of Module [2] due to source resolution failure. 2616: Companion file

  • Reason: Member has been banned from the site For more information, visit our FAQ's.
  • Nothing to be done 13 ERROR_INVALID_DATA The data is invalid 87 ERROR_INVALID_PARAMETER One of the parameters was invalid. 1601 ERROR_INSTALL_SERVICE_FAILURE The Windows Installer service could not be accessed.
  • ERROR_PRODUCT_VERSION1638Another version of this product is already installed.
  • Solution: When deploying these types of Scripted installs from either Deployment Server or Notification Server the solution would be these options: Force a reboot after the install to finish the installation
  • Verify that y... 1927: The installation requires COM+ Services to be installed. 1928: The installation failed to install the COM+ Application. 1929: The installation failed to remove the COM+ Application. 1930:
  • Table does not exist: [3]. 2206: Database: [2].
  • Answered 05/11/2011 by: WSPPackager Please log in to comment Please log in to comment Answer this question or Comment on this question for clarity AnswerSubmit Don't be a Stranger!

Many applications are built around Windows Installer. Contact your support ... 1913: Could not update the .ini file [2][3]. GetLastError: [2]. 2330: Error getting file attributes: [3]. Msi Error 1618 Verify that you have sufficient ... 1921: Service '[2]' ([3]) could not be stopped.

But for me in reality, it is not practical to go deeper on each MSI just find out where 3010 come from if you have tens or hundreds more MSI´s to Msi Error Code 1603 Che... 1712: One or more of the files required to restore your computer to its pre... 1713: [2] cannot install one of its required products. Your choices in dealing with this error are 2: 1. http://forum.sysinternals.com/error-code-3010_topic16817.html Contact your support personnel. 1611 ERROR_INDEX_ABSENT Component qualifier not present. 1612 ERROR_INSTALL_SOURCE_ABSENT The installation source for this product is not available.

This error code ... 1644: One or more customizations are not permitted by system policy. 1645: Windows Installer does not permit installation from a Remote Desktop ... 1646: The patch package Psexec Error Code 1619 Then when you install the app, your log file should end with a return code 0 instead of 3010. System error [4]. 1406: Could not write value [2] to key [3]. what throw me off was the installation error below which wasn't helpfull ERROR 2013/06/18 10:58:14:551 TID:2060 PID:2412 Operation failed: Flow InternalRun - .  0x80070643.

Msi Error Code 1603

Missing FROM clause in SQL query: [3]. 2239: Database: [2]. see this here ERROR_PATCH_MANAGED_ADVERTISED_PRODUCT 1651Administrative user failed to apply patch for a per-user managed or a per-machine application that is in advertise state. Msi Error Codes This is ... 2879: The control [3] on dialog [2] cannot parse the mask string: [4]. 2880: Do not perform the remaining control events. 2881: CMsiHandler initialization failed. 2882: Dialog window Windows Installer Error Codes Was this article helpful? 2 out of 3 found this helpful Have more questions?

The required file 'CABINET.... 2353: Not a cabinet. 2354: Cannot handle cabinet. 2355: Corrupt cabinet. 2356: Couldn't locate cabinet in stream: [2]. 2357: Cannot set attributes. 2358: Error determining whether file check over here ERROR_INVALID_HANDLE_STATE1609The handle is in an invalid state. Complete that installati... 1619: This installation package could not be opened. Thank you for your feedback! Msi Motherboard Error Codes

Table: ... 2226: Database: [2]. Must restart to comp... 1904: Module [2] failed to register. Insufficient parameters for Execute. 2209: Database: [2]. his comment is here Code page [3] not supported by the system. 2277: Database: [2].

Answered 05/05/2011 by: dj_xest Please log in to comment Please log in to comment 0 ORIGINAL: We want to supress this since it will help to install other application in the Windows Installer Error 1619 Database not in writable state. 2213: Database: [2]. vcredist_x64.exe /q /norestart However these sometimes exit with a code of 3010 (soft-reboot).

Answered 05/06/2011 by: bearden3 Please log in to comment Please log in to comment 0 Not to say that any of the responses here aren't helpful, but if you want answers

This will be returned by the Windows Installer during the installation time. Education Services Maximize your product competency and validate technical knowledge to gain the most benefit from your IT investments. Tha... 1601: The Windows Installer Service Could Not Be Accessed 1601: The Windows Installer service could not be accessed. Error 1619 Autodesk Giving good results.

A program req... 1722: There is a problem with this Windows Installer package. Table already exists: [3]. 2205: Database: [2]. Contact the application vendor to verify that this is a valid Windows Installer patch package. 1637 ERROR_PATCH_PACKAGE_UNSUPPORTED This patch package cannot be processed by the Windows Installer service. weblink Table name not supplied. 2219: Database: [2].